{"text_format":"1","workbook":"xlsx","n_sheets":5,"sheets":["Calibration Log","Maintenance Log","Intermediate Calcs","validation tables","version history"],"not_rendered":{"charts":1,"images":0,"macros":1,"external_links":0,"defined_names":0,"comments":0,"pivot_tables":0},"unopened":[],"bounds":{"document_bytes":16777216,"sheet_cells":100000,"rows_first":2000,"rows_last":500,"rows_between":2000,"halvings":0,"cell_chars":16384,"cell_head_chars":4096},"cells_cut":0,"cells_raw":0,"read":"whole","date_system":"1900"}

{"sheet":"Calibration Log","index":0,"n_rows":146,"n_cols":19,"rows_kept":146,"cut":false,"hidden":false,"merged":[[16,15,16,16],[20,0,21,6],[2,14,18,14]]}
[]
[null,"Select Y Column:","pH 7 drift",null,null,null,null,null,null,null,null,null,null,null,"Recommended action based on latest calibration event:","© Treynor Consulting, 2018"]
[null,"Select Date Column:","WHEN",null,null,null,null,null,null,null,null,null,null,null,{"$f":"IFERROR(IF(AND(LEN(INDEX(PasteData[slope (%)],MATCH(MAX(PasteData[Index]),PasteData[Index],0))),OR(INDEX(PasteData[slope (%)],MATCH(MAX(PasteData[Index]),PasteData[Index],0))>$M$21,INDEX(PasteData[slope (%)],MATCH(MAX(PasteData[Index]),PasteData[Index],0))<$M$22)),\"Perform maintenance or replace probe to get SLOPE back within spec limits. \",\"\")&IF(AND(LEN(INDEX(PasteData[offset (mV)],MATCH(MAX(PasteData[Index]),PasteData[Index],0))),OR(INDEX(PasteData[offset (mV)],MATCH(MAX(PasteData[Index]),PasteData[Index],0))>$N$21,INDEX(PasteData[offset (mV)],MATCH(MAX(PasteData[Index]),PasteData[Index],0))<$N$22)),\"Perform maintenance or replace probe to get OFFSET back within spec limits. \",\"\")&IF(LEN(INDEX(ChartData[check 3 sigma],MATCH(MAX(PasteData[Index]),ChartData[Sorted Index],0))),\"Unusually large SHIFT observed. IF pH station was NOT found in good condition, re-train previous user of this probe.\"&\" IF large shift observed even though pH station found in good condition, communicate your observation of this unusually large shift to previous user so they can consider what impact the pH shift may have had on their recent experiment.\"&\" Consider re-training for yourself and/or previous user. \",\"\"),\"\")","v":""}]
[]
[null,"N Points:",{"$f":"COUNT('Intermediate Calcs'!L:L)","v":0}]
[]
[null,"UCL:",{"$f":"IFERROR('Intermediate Calcs'!$Y$2+'Intermediate Calcs'!$Y$4, \"\")","v":""}]
[null,"X-bar:",{"$f":"IFERROR('Intermediate Calcs'!$Y$2,\"Enter Data Below, Select Columns Above\")","v":"Enter Data Below, Select Columns Above"}]
[null,"LCL:",{"$f":"IFERROR('Intermediate Calcs'!$Y$2-'Intermediate Calcs'!$Y$4,\"\")","v":""}]
[]
{"$rows_left_out":137}
{"sheet":"Maintenance Log","index":1,"n_rows":5,"n_cols":6,"rows_kept":5,"cut":false,"hidden":false,"merged":[]}
[]
[null,"WHO","WHAT","WHEN","WHERE","WHY"]
[null,"Operator2","replaced calibration buffers","2018-09-01","MeterA","calibration buffers always replaced on first of every month"]
[null,"Operator4","replaced pH 7 calibration buffer","2018-09-06","MeterA","spilled previous pH 7 calibration buffer"]
[null,"Operator2","added electrode solution","2018-09-13","Probe1","level was low"]

{"sheet":"Intermediate Calcs","index":2,"n_rows":101,"n_cols":25,"rows_kept":101,"cut":false,"hidden":false,"merged":[]}
[null,null,null,null,"Unsorted Index","Unsorted Dates","Unsorted Data","Ranked Dates",null,"Sorted Index","Sorted Dates","Sorted Data","Moving Range","Date","Y","UCL","X-bar","LCL","check 3 sigma","check 9 on same side","check 14 alternating","Out of Control"]
[null,"Find Y Column:",{"$f":"MATCH('Calibration Log'!C2,PasteData[#Headers],0)","v":7},null,{"$f":"IF(ISNUMBER(E1),E1+1,1)","v":1},{"$f":"IFERROR(VLOOKUP(SortData[[#This Row],[Unsorted Index]],PasteData[#All],'Intermediate Calcs'!$C$3,0),\"\")","v":""},{"$f":"IFERROR(VLOOKUP(SortData[[#This Row],[Unsorted Index]],PasteData[#All],'Intermediate Calcs'!$C$2,0),\"\")","v":""},{"$f":"IFERROR(RANK(SortData[[#This Row],[Unsorted Dates]],SortData[Unsorted Dates],1)+COUNTIF($F$2:F2,SortData[[#This Row],[Unsorted Dates]])-1,\"\")","v":""},null,{"$f":"IF(ISNUMBER(J1),J1+1,1)","v":1},{"$f":"IFERROR(INDEX(SortData[Unsorted Dates],MATCH(ChartData[[#This Row],[Sorted Index]],SortData[Ranked Dates],0)),\"\")","v":""},{"$f":"IFERROR(INDEX(SortData[Unsorted Data],MATCH(ChartData[[#This Row],[Sorted Index]],SortData[Ranked Dates],0)),\"\")","v":""},{"$f":"IF(AND(ISNUMBER(L1),ISNUMBER(L2)),ABS(L1-L2),\"\")","v":""},{"$f":"IF(ISNUMBER(ChartData[[#This Row],[Sorted Dates]]),ChartData[[#This Row],[Sorted Dates]],NA())","v":{"$error":"#N/A"}},{"$f":"IF(ISNUMBER(ChartData[[#This Row],[Sorted Data]]),ChartData[[#This Row],[Sorted Data]],NA())","v":{"$error":"#N/A"}},{"$f":"IF(LEN(ChartData[[#This Row],[Sorted Data]]),$Y$2+$Y$4,NA())","v":{"$error":"#N/A"}},{"$f":"IF(LEN(ChartData[[#This Row],[Sorted Data]]),$Y$2,NA())","v":{"$error":"#N/A"}},{"$f":"IF(LEN(ChartData[[#This Row],[Sorted Data]]),$Y$2-$Y$4,NA())","v":{"$error":"#N/A"}},{"$f":"IF(OR(ChartData[[#This Row],[Y]]>ChartData[[#This Row],[UCL]],ChartData[[#This Row],[Y]]<ChartData[[#This Row],[LCL]]),\"OOC\",\"\")","v":{"$error":"#N/A"}},{"$f":"IFERROR(IF(OR(COUNTIF(#REF!,\">\"&ChartData[[#This Row],[X-bar]])=9,COUNTIF(#REF!,\"<\"&ChartData[[#This Row],[X-bar]])=9),\"OOC\",\"\"),\"\")","v":""},{"$f":"IFERROR(IF(AND(SIGN(#REF!-#REF!)=1,SIGN(#REF!-#REF!)=-1,SIGN(#REF!-#REF!)=1,SIGN(#REF!-#REF!)=-1,SIGN(#REF!-#REF!)=1,SIGN(#REF!-#REF!)=-1,SIGN(#REF!-#REF!)=1,SIGN(#REF!-#REF!)=-1,SIGN(#REF!-#REF!)=1,SIGN(#REF!-#REF!)=-1,SIGN(#REF!-#REF!)=1,SIGN(L1-#REF!)=-1,SIGN(L2-L1)=1),\"OOC\",IF(AND(SIGN(#REF!-#REF!)=-1,SIGN(#REF!-#REF!)=1,SIGN(#REF!-#REF!)=-1,SIGN(#REF!-#REF!)=1,SIGN(#REF!-#REF!)=-1,SIGN(#REF!-#REF!)=1,SIGN(#REF!-#REF!)=-1,SIGN(#REF!-#REF!)=1,SIGN(#REF!-#REF!)=-1,SIGN(#REF!-#REF!)=1,SIGN(#REF!-#REF!)=-1,SIGN(L1-#REF!)=1,SIGN(L2-L1)=-1),\"OOC\",\"\")),\"\")","v":""},{"$f":"IF(LEN(ChartData[[#This Row],[check 3 sigma]]),ChartData[[#This Row],[Y]],NA())","v":{"$error":"#N/A"}},null,"mean(data)",{"$f":"AVERAGE(ChartData[Sorted Data])","v":{"$error":"#DIV/0!"}}]
[null,"Find Date Column:",{"$f":"MATCH('Calibration Log'!C3,PasteData[#Headers],0)","v":3},null,{"$f":"IF(ISNUMBER(E2),E2+1,1)","v":2},{"$f":"IFERROR(VLOOKUP(SortData[[#This Row],[Unsorted Index]],PasteData[#All],'Intermediate Calcs'!$C$3,0),\"\")","v":""},{"$f":"IFERROR(VLOOKUP(SortData[[#This Row],[Unsorted Index]],PasteData[#All],'Intermediate Calcs'!$C$2,0),\"\")","v":""},{"$f":"IFERROR(RANK(SortData[[#This Row],[Unsorted Dates]],SortData[Unsorted Dates],1)+COUNTIF($F$2:F3,SortData[[#This Row],[Unsorted Dates]])-1,\"\")","v":""},null,{"$f":"IF(ISNUMBER(J2),J2+1,1)","v":2},{"$f":"IFERROR(INDEX(SortData[Unsorted Dates],MATCH(ChartData[[#This Row],[Sorted Index]],SortData[Ranked Dates],0)),\"\")","v":""},{"$f":"IFERROR(INDEX(SortData[Unsorted Data],MATCH(ChartData[[#This Row],[Sorted Index]],SortData[Ranked Dates],0)),\"\")","v":""},{"$f":"IF(AND(ISNUMBER(L2),ISNUMBER(L3)),ABS(L2-L3),\"\")","v":""},{"$f":"IF(ISNUMBER(ChartData[[#This Row],[Sorted Dates]]),ChartData[[#This Row],[Sorted Dates]],NA())","v":{"$error":"#N/A"}},{"$f":"IF(ISNUMBER(ChartData[[#This Row],[Sorted Data]]),ChartData[[#This Row],[Sorted Data]],NA())","v":{"$error":"#N/A"}},{"$f":"IF(LEN(ChartData[[#This Row],[Sorted Data]]),$Y$2+$Y$4,NA())","v":{"$error":"#N/A"}},{"$f":"IF(LEN(ChartData[[#This Row],[Sorted Data]]),$Y$2,NA())","v":{"$error":"#N/A"}},{"$f":"IF(LEN(ChartData[[#This Row],[Sorted Data]]),$Y$2-$Y$4,NA())","v":{"$error":"#N/A"}},{"$f":"IF(OR(ChartData[[#This Row],[Y]]>ChartData[[#This Row],[UCL]],ChartData[[#This Row],[Y]]<ChartData[[#This Row],[LCL]]),\"OOC\",\"\")","v":{"$error":"#N/A"}},{"$f":"IFERROR(IF(OR(COUNTIF(#REF!,\">\"&ChartData[[#This Row],[X-bar]])=9,COUNTIF(#REF!,\"<\"&ChartData[[#This Row],[X-bar]])=9),\"OOC\",\"\"),\"\")","v":""},{"$f":"IFERROR(IF(AND(SIGN(#REF!-#REF!)=1,SIGN(#REF!-#REF!)=-1,SIGN(#REF!-#REF!)=1,SIGN(#REF!-#REF!)=-1,SIGN(#REF!-#REF!)=1,SIGN(#REF!-#REF!)=-1,SIGN(#REF!-#REF!)=1,SIGN(#REF!-#REF!)=-1,SIGN(#REF!-#REF!)=1,SIGN(#REF!-#REF!)=-1,SIGN(L1-#REF!)=1,SIGN(L2-L1)=-1,SIGN(L3-L2)=1),\"OOC\",IF(AND(SIGN(#REF!-#REF!)=-1,SIGN(#REF!-#REF!)=1,SIGN(#REF!-#REF!)=-1,SIGN(#REF!-#REF!)=1,SIGN(#REF!-#REF!)=-1,SIGN(#REF!-#REF!)=1,SIGN(#REF!-#REF!)=-1,SIGN(#REF!-#REF!)=1,SIGN(#REF!-#REF!)=-1,SIGN(#REF!-#REF!)=1,SIGN(L1-#REF!)=-1,SIGN(L2-L1)=1,SIGN(L3-L2)=-1),\"OOC\",\"\")),\"\")","v":""},{"$f":"IF(LEN(ChartData[[#This Row],[check 3 sigma]]),ChartData[[#This Row],[Y]],NA())","v":{"$error":"#N/A"}},null,"mean(MR)",{"$f":"AVERAGE(M:M)","v":{"$error":"#DIV/0!"}}]
[null,null,null,null,3,{"$f":"IFERROR(VLOOKUP(SortData[[#This Row],[Unsorted Index]],PasteData[#All],'Intermediate Calcs'!$C$3,0),\"\")","v":""},{"$f":"IFERROR(VLOOKUP(SortData[[#This Row],[Unsorted Index]],PasteData[#All],'Intermediate Calcs'!$C$2,0),\"\")","v":""},{"$f":"IFERROR(RANK(SortData[[#This Row],[Unsorted Dates]],SortData[Unsorted Dates],1)+COUNTIF($F$2:F4,SortData[[#This Row],[Unsorted Dates]])-1,\"\")","v":""},null,3,{"$f":"IFERROR(INDEX(SortData[Unsorted Dates],MATCH(ChartData[[#This Row],[Sorted Index]],SortData[Ranked Dates],0)),\"\")","v":""},{"$f":"IFERROR(INDEX(SortData[Unsorted Data],MATCH(ChartData[[#This Row],[Sorted Index]],SortData[Ranked Dates],0)),\"\")","v":""},"",{"$f":"IF(ISNUMBER(ChartData[[#This Row],[Sorted Dates]]),ChartData[[#This Row],[Sorted Dates]],NA())","v":{"$error":"#N/A"}},{"$f":"IF(ISNUMBER(ChartData[[#This Row],[Sorted Data]]),ChartData[[#This Row],[Sorted Data]],NA())","v":{"$error":"#N/A"}},{"$f":"IF(LEN(ChartData[[#This Row],[Sorted Data]]),$Y$2+$Y$4,NA())","v":{"$error":"#N/A"}},{"$f":"IF(LEN(ChartData[[#This Row],[Sorted Data]]),$Y$2,NA())","v":{"$error":"#N/A"}},{"$f":"IF(LEN(ChartData[[#This Row],[Sorted Data]]),$Y$2-$Y$4,NA())","v":{"$error":"#N/A"}},{"$f":"IF(OR(ChartData[[#This Row],[Y]]>ChartData[[#This Row],[UCL]],ChartData[[#This Row],[Y]]<ChartData[[#This Row],[LCL]]),\"OOC\",\"\")","v":{"$error":"#N/A"}},{"$f":"IFERROR(IF(OR(COUNTIF(#REF!,\">\"&ChartData[[#This Row],[X-bar]])=9,COUNTIF(#REF!,\"<\"&ChartData[[#This Row],[X-bar]])=9),\"OOC\",\"\"),\"\")","v":""},{"$f":"IFERROR(IF(AND(SIGN(#REF!-#REF!)=1,SIGN(#REF!-#REF!)=-1,SIGN(#REF!-#REF!)=1,SIGN(#REF!-#REF!)=-1,SIGN(#REF!-#REF!)=1,SIGN(#REF!-#REF!)=-1,SIGN(#REF!-#REF!)=1,SIGN(#REF!-#REF!)=-1,SIGN(#REF!-#REF!)=1,SIGN(L1-#REF!)=-1,SIGN(L2-L1)=1,SIGN(L3-L2)=-1,SIGN(L4-L3)=1),\"OOC\",IF(AND(SIGN(#REF!-#REF!)=-1,SIGN(#REF!-#REF!)=1,SIGN(#REF!-#REF!)=-1,SIGN(#REF!-#REF!)=1,SIGN(#REF!-#REF!)=-1,SIGN(#REF!-#REF!)=1,SIGN(#REF!-#REF!)=-1,SIGN(#REF!-#REF!)=1,SIGN(#REF!-#REF!)=-1,SIGN(L1-#REF!)=1,SIGN(L2-L1)=-1,SIGN(L3-L2)=1,SIGN(L4-L3)=-1),\"OOC\",\"\")),\"\")","v":""},{"$f":"IF(LEN(ChartData[[#This Row],[check 3 sigma]]),ChartData[[#This Row],[Y]],NA())","v":{"$error":"#N/A"}},null,"3*sigma-ST",{"$f":"2.66*Y3","v":{"$error":"#DIV/0!"}}]
[null,"© Treynor Consulting, 2018",null,null,4,{"$f":"IFERROR(VLOOKUP(SortData[[#This Row],[Unsorted Index]],PasteData[#All],'Intermediate Calcs'!$C$3,0),\"\")","v":""},{"$f":"IFERROR(VLOOKUP(SortData[[#This Row],[Unsorted Index]],PasteData[#All],'Intermediate Calcs'!$C$2,0),\"\")","v":""},{"$f":"IFERROR(RANK(SortData[[#This Row],[Unsorted Dates]],SortData[Unsorted Dates],1)+COUNTIF($F$2:F5,SortData[[#This Row],[Unsorted Dates]])-1,\"\")","v":""},null,4,{"$f":"IFERROR(INDEX(SortData[Unsorted Dates],MATCH(ChartData[[#This Row],[Sorted Index]],SortData[Ranked Dates],0)),\"\")","v":""},{"$f":"IFERROR(INDEX(SortData[Unsorted Data],MATCH(ChartData[[#This Row],[Sorted Index]],SortData[Ranked Dates],0)),\"\")","v":""},"",{"$f":"IF(ISNUMBER(ChartData[[#This Row],[Sorted Dates]]),ChartData[[#This Row],[Sorted Dates]],NA())","v":{"$error":"#N/A"}},{"$f":"IF(ISNUMBER(ChartData[[#This Row],[Sorted Data]]),ChartData[[#This Row],[Sorted Data]],NA())","v":{"$error":"#N/A"}},{"$f":"IF(LEN(ChartData[[#This Row],[Sorted Data]]),$Y$2+$Y$4,NA())","v":{"$error":"#N/A"}},{"$f":"IF(LEN(ChartData[[#This Row],[Sorted Data]]),$Y$2,NA())","v":{"$error":"#N/A"}},{"$f":"IF(LEN(ChartData[[#This Row],[Sorted Data]]),$Y$2-$Y$4,NA())","v":{"$error":"#N/A"}},{"$f":"IF(OR(ChartData[[#This Row],[Y]]>ChartData[[#This Row],[UCL]],ChartData[[#This Row],[Y]]<ChartData[[#This Row],[LCL]]),\"OOC\",\"\")","v":{"$error":"#N/A"}},{"$f":"IFERROR(IF(OR(COUNTIF(#REF!,\">\"&ChartData[[#This Row],[X-bar]])=9,COUNTIF(#REF!,\"<\"&ChartData[[#This Row],[X-bar]])=9),\"OOC\",\"\"),\"\")","v":""},{"$f":"IFERROR(IF(AND(SIGN(#REF!-#REF!)=1,SIGN(#REF!-#REF!)=-1,SIGN(#REF!-#REF!)=1,SIGN(#REF!-#REF!)=-1,SIGN(#REF!-#REF!)=1,SIGN(#REF!-#REF!)=-1,SIGN(#REF!-#REF!)=1,SIGN(#REF!-#REF!)=-1,SIGN(L1-#REF!)=1,SIGN(L2-L1)=-1,SIGN(L3-L2)=1,SIGN(L4-L3)=-1,SIGN(L5-L4)=1),\"OOC\",IF(AND(SIGN(#REF!-#REF!)=-1,SIGN(#REF!-#REF!)=1,SIGN(#REF!-#REF!)=-1,SIGN(#REF!-#REF!)=1,SIGN(#REF!-#REF!)=-1,SIGN(#REF!-#REF!)=1,SIGN(#REF!-#REF!)=-1,SIGN(#REF!-#REF!)=1,SIGN(L1-#REF!)=-1,SIGN(L2-L1)=1,SIGN(L3-L2)=-1,SIGN(L4-L3)=1,SIGN(L5-L4)=-1),\"OOC\",\"\")),\"\")","v":""},{"$f":"IF(LEN(ChartData[[#This Row],[check 3 sigma]]),ChartData[[#This Row],[Y]],NA())","v":{"$error":"#N/A"}},null,"sigma-ST",{"$f":"Y4/3","v":{"$error":"#DIV/0!"}}]
[null,null,null,null,5,{"$f":"IFERROR(VLOOKUP(SortData[[#This Row],[Unsorted Index]],PasteData[#All],'Intermediate Calcs'!$C$3,0),\"\")","v":""},{"$f":"IFERROR(VLOOKUP(SortData[[#This Row],[Unsorted Index]],PasteData[#All],'Intermediate Calcs'!$C$2,0),\"\")","v":""},{"$f":"IFERROR(RANK(SortData[[#This Row],[Unsorted Dates]],SortData[Unsorted Dates],1)+COUNTIF($F$2:F6,SortData[[#This Row],[Unsorted Dates]])-1,\"\")","v":""},null,5,{"$f":"IFERROR(INDEX(SortData[Unsorted Dates],MATCH(ChartData[[#This Row],[Sorted Index]],SortData[Ranked Dates],0)),\"\")","v":""},{"$f":"IFERROR(INDEX(SortData[Unsorted Data],MATCH(ChartData[[#This Row],[Sorted Index]],SortData[Ranked Dates],0)),\"\")","v":""},"",{"$f":"IF(ISNUMBER(ChartData[[#This Row],[Sorted Dates]]),ChartData[[#This Row],[Sorted Dates]],NA())","v":{"$error":"#N/A"}},{"$f":"IF(ISNUMBER(ChartData[[#This Row],[Sorted Data]]),ChartData[[#This Row],[Sorted Data]],NA())","v":{"$error":"#N/A"}},{"$f":"IF(LEN(ChartData[[#This Row],[Sorted Data]]),$Y$2+$Y$4,NA())","v":{"$error":"#N/A"}},{"$f":"IF(LEN(ChartData[[#This Row],[Sorted Data]]),$Y$2,NA())","v":{"$error":"#N/A"}},{"$f":"IF(LEN(ChartData[[#This Row],[Sorted Data]]),$Y$2-$Y$4,NA())","v":{"$error":"#N/A"}},{"$f":"IF(OR(ChartData[[#This Row],[Y]]>ChartData[[#This Row],[UCL]],ChartData[[#This Row],[Y]]<ChartData[[#This Row],[LCL]]),\"OOC\",\"\")","v":{"$error":"#N/A"}},{"$f":"IFERROR(IF(OR(COUNTIF(#REF!,\">\"&ChartData[[#This Row],[X-bar]])=9,COUNTIF(#REF!,\"<\"&ChartData[[#This Row],[X-bar]])=9),\"OOC\",\"\"),\"\")","v":""},{"$f":"IFERROR(IF(AND(SIGN(#REF!-#REF!)=1,SIGN(#REF!-#REF!)=-1,SIGN(#REF!-#REF!)=1,SIGN(#REF!-#REF!)=-1,SIGN(#REF!-#REF!)=1,SIGN(#REF!-#REF!)=-1,SIGN(#REF!-#REF!)=1,SIGN(L1-#REF!)=-1,SIGN(L2-L1)=1,SIGN(L3-L2)=-1,SIGN(L4-L3)=1,SIGN(L5-L4)=-1,SIGN(L6-L5)=1),\"OOC\",IF(AND(SIGN(#REF!-#REF!)=-1,SIGN(#REF!-#REF!)=1,SIGN(#REF!-#REF!)=-1,SIGN(#REF!-#REF!)=1,SIGN(#REF!-#REF!)=-1,SIGN(#REF!-#REF!)=1,SIGN(#REF!-#REF!)=-1,SIGN(L1-#REF!)=1,SIGN(L2-L1)=-1,SIGN(L3-L2)=1,SIGN(L4-L3)=-1,SIGN(L5-L4)=1,SIGN(L6-L5)=-1),\"OOC\",\"\")),\"\")","v":""},{"$f":"IF(LEN(ChartData[[#This Row],[check 3 sigma]]),ChartData[[#This Row],[Y]],NA())","v":{"$error":"#N/A"}},null,"sigma-LT",{"$f":"STDEV(L:L)","v":{"$error":"#DIV/0!"}}]
[null,null,null,null,6,{"$f":"IFERROR(VLOOKUP(SortData[[#This Row],[Unsorted Index]],PasteData[#All],'Intermediate Calcs'!$C$3,0),\"\")","v":""},{"$f":"IFERROR(VLOOKUP(SortData[[#This Row],[Unsorted Index]],PasteData[#All],'Intermediate Calcs'!$C$2,0),\"\")","v":""},{"$f":"IFERROR(RANK(SortData[[#This Row],[Unsorted Dates]],SortData[Unsorted Dates],1)+COUNTIF($F$2:F7,SortData[[#This Row],[Unsorted Dates]])-1,\"\")","v":""},null,6,{"$f":"IFERROR(INDEX(SortData[Unsorted Dates],MATCH(ChartData[[#This Row],[Sorted Index]],SortData[Ranked Dates],0)),\"\")","v":""},{"$f":"IFERROR(INDEX(SortData[Unsorted Data],MATCH(ChartData[[#This Row],[Sorted Index]],SortData[Ranked Dates],0)),\"\")","v":""},"",{"$f":"IF(ISNUMBER(ChartData[[#This Row],[Sorted Dates]]),ChartData[[#This Row],[Sorted Dates]],NA())","v":{"$error":"#N/A"}},{"$f":"IF(ISNUMBER(ChartData[[#This Row],[Sorted Data]]),ChartData[[#This Row],[Sorted Data]],NA())","v":{"$error":"#N/A"}},{"$f":"IF(LEN(ChartData[[#This Row],[Sorted Data]]),$Y$2+$Y$4,NA())","v":{"$error":"#N/A"}},{"$f":"IF(LEN(ChartData[[#This Row],[Sorted Data]]),$Y$2,NA())","v":{"$error":"#N/A"}},{"$f":"IF(LEN(ChartData[[#This Row],[Sorted Data]]),$Y$2-$Y$4,NA())","v":{"$error":"#N/A"}},{"$f":"IF(OR(ChartData[[#This Row],[Y]]>ChartData[[#This Row],[UCL]],ChartData[[#This Row],[Y]]<ChartData[[#This Row],[LCL]]),\"OOC\",\"\")","v":{"$error":"#N/A"}},{"$f":"IFERROR(IF(OR(COUNTIF(#REF!,\">\"&ChartData[[#This Row],[X-bar]])=9,COUNTIF(#REF!,\"<\"&ChartData[[#This Row],[X-bar]])=9),\"OOC\",\"\"),\"\")","v":""},{"$f":"IFERROR(IF(AND(SIGN(#REF!-#REF!)=1,SIGN(#REF!-#REF!)=-1,SIGN(#REF!-#REF!)=1,SIGN(#REF!-#REF!)=-1,SIGN(#REF!-#REF!)=1,SIGN(#REF!-#REF!)=-1,SIGN(L1-#REF!)=1,SIGN(L2-L1)=-1,SIGN(L3-L2)=1,SIGN(L4-L3)=-1,SIGN(L5-L4)=1,SIGN(L6-L5)=-1,SIGN(L7-L6)=1),\"OOC\",IF(AND(SIGN(#REF!-#REF!)=-1,SIGN(#REF!-#REF!)=1,SIGN(#REF!-#REF!)=-1,SIGN(#REF!-#REF!)=1,SIGN(#REF!-#REF!)=-1,SIGN(#REF!-#REF!)=1,SIGN(L1-#REF!)=-1,SIGN(L2-L1)=1,SIGN(L3-L2)=-1,SIGN(L4-L3)=1,SIGN(L5-L4)=-1,SIGN(L6-L5)=1,SIGN(L7-L6)=-1),\"OOC\",\"\")),\"\")","v":""},{"$f":"IF(LEN(ChartData[[#This Row],[check 3 sigma]]),ChartData[[#This Row],[Y]],NA())","v":{"$error":"#N/A"}}]
[null,null,null,null,7,{"$f":"IFERROR(VLOOKUP(SortData[[#This Row],[Unsorted Index]],PasteData[#All],'Intermediate Calcs'!$C$3,0),\"\")","v":""},{"$f":"IFERROR(VLOOKUP(SortData[[#This Row],[Unsorted Index]],PasteData[#All],'Intermediate Calcs'!$C$2,0),\"\")","v":""},{"$f":"IFERROR(RANK(SortData[[#This Row],[Unsorted Dates]],SortData[Unsorted Dates],1)+COUNTIF($F$2:F8,SortData[[#This Row],[Unsorted Dates]])-1,\"\")","v":""},null,7,{"$f":"IFERROR(INDEX(SortData[Unsorted Dates],MATCH(ChartData[[#This Row],[Sorted Index]],SortData[Ranked Dates],0)),\"\")","v":""},{"$f":"IFERROR(INDEX(SortData[Unsorted Data],MATCH(ChartData[[#This Row],[Sorted Index]],SortData[Ranked Dates],0)),\"\")","v":""},"",{"$f":"IF(ISNUMBER(ChartData[[#This Row],[Sorted Dates]]),ChartData[[#This Row],[Sorted Dates]],NA())","v":{"$error":"#N/A"}},{"$f":"IF(ISNUMBER(ChartData[[#This Row],[Sorted Data]]),ChartData[[#This Row],[Sorted Data]],NA())","v":{"$error":"#N/A"}},{"$f":"IF(LEN(ChartData[[#This Row],[Sorted Data]]),$Y$2+$Y$4,NA())","v":{"$error":"#N/A"}},{"$f":"IF(LEN(ChartData[[#This Row],[Sorted Data]]),$Y$2,NA())","v":{"$error":"#N/A"}},{"$f":"IF(LEN(ChartData[[#This Row],[Sorted Data]]),$Y$2-$Y$4,NA())","v":{"$error":"#N/A"}},{"$f":"IF(OR(ChartData[[#This Row],[Y]]>ChartData[[#This Row],[UCL]],ChartData[[#This Row],[Y]]<ChartData[[#This Row],[LCL]]),\"OOC\",\"\")","v":{"$error":"#N/A"}},{"$f":"IFERROR(IF(OR(COUNTIF(#REF!,\">\"&ChartData[[#This Row],[X-bar]])=9,COUNTIF(#REF!,\"<\"&ChartData[[#This Row],[X-bar]])=9),\"OOC\",\"\"),\"\")","v":""},{"$f":"IFERROR(IF(AND(SIGN(#REF!-#REF!)=1,SIGN(#REF!-#REF!)=-1,SIGN(#REF!-#REF!)=1,SIGN(#REF!-#REF!)=-1,SIGN(#REF!-#REF!)=1,SIGN(L1-#REF!)=-1,SIGN(L2-L1)=1,SIGN(L3-L2)=-1,SIGN(L4-L3)=1,SIGN(L5-L4)=-1,SIGN(L6-L5)=1,SIGN(L7-L6)=-1,SIGN(L8-L7)=1),\"OOC\",IF(AND(SIGN(#REF!-#REF!)=-1,SIGN(#REF!-#REF!)=1,SIGN(#REF!-#REF!)=-1,SIGN(#REF!-#REF!)=1,SIGN(#REF!-#REF!)=-1,SIGN(L1-#REF!)=1,SIGN(L2-L1)=-1,SIGN(L3-L2)=1,SIGN(L4-L3)=-1,SIGN(L5-L4)=1,SIGN(L6-L5)=-1,SIGN(L7-L6)=1,SIGN(L8-L7)=-1),\"OOC\",\"\")),\"\")","v":""},{"$f":"IF(LEN(ChartData[[#This Row],[check 3 sigma]]),ChartData[[#This Row],[Y]],NA())","v":{"$error":"#N/A"}}]
[null,null,null,null,8,{"$f":"IFERROR(VLOOKUP(SortData[[#This Row],[Unsorted Index]],PasteData[#All],'Intermediate Calcs'!$C$3,0),\"\")","v":""},{"$f":"IFERROR(VLOOKUP(SortData[[#This Row],[Unsorted Index]],PasteData[#All],'Intermediate Calcs'!$C$2,0),\"\")","v":""},{"$f":"IFERROR(RANK(SortData[[#This Row],[Unsorted Dates]],SortData[Unsorted Dates],1)+COUNTIF($F$2:F9,SortData[[#This Row],[Unsorted Dates]])-1,\"\")","v":""},null,8,{"$f":"IFERROR(INDEX(SortData[Unsorted Dates],MATCH(ChartData[[#This Row],[Sorted Index]],SortData[Ranked Dates],0)),\"\")","v":""},{"$f":"IFERROR(INDEX(SortData[Unsorted Data],MATCH(ChartData[[#This Row],[Sorted Index]],SortData[Ranked Dates],0)),\"\")","v":""},"",{"$f":"IF(ISNUMBER(ChartData[[#This Row],[Sorted Dates]]),ChartData[[#This Row],[Sorted Dates]],NA())","v":{"$error":"#N/A"}},{"$f":"IF(ISNUMBER(ChartData[[#This Row],[Sorted Data]]),ChartData[[#This Row],[Sorted Data]],NA())","v":{"$error":"#N/A"}},{"$f":"IF(LEN(ChartData[[#This Row],[Sorted Data]]),$Y$2+$Y$4,NA())","v":{"$error":"#N/A"}},{"$f":"IF(LEN(ChartData[[#This Row],[Sorted Data]]),$Y$2,NA())","v":{"$error":"#N/A"}},{"$f":"IF(LEN(ChartData[[#This Row],[Sorted Data]]),$Y$2-$Y$4,NA())","v":{"$error":"#N/A"}},{"$f":"IF(OR(ChartData[[#This Row],[Y]]>ChartData[[#This Row],[UCL]],ChartData[[#This Row],[Y]]<ChartData[[#This Row],[LCL]]),\"OOC\",\"\")","v":{"$error":"#N/A"}},{"$f":"IFERROR(IF(OR(COUNTIF(L1:L9,\">\"&ChartData[[#This Row],[X-bar]])=9,COUNTIF(L1:L9,\"<\"&ChartData[[#This Row],[X-bar]])=9),\"OOC\",\"\"),\"\")","v":""},{"$f":"IFERROR(IF(AND(SIGN(#REF!-#REF!)=1,SIGN(#REF!-#REF!)=-1,SIGN(#REF!-#REF!)=1,SIGN(#REF!-#REF!)=-1,SIGN(L1-#REF!)=1,SIGN(L2-L1)=-1,SIGN(L3-L2)=1,SIGN(L4-L3)=-1,SIGN(L5-L4)=1,SIGN(L6-L5)=-1,SIGN(L7-L6)=1,SIGN(L8-L7)=-1,SIGN(L9-L8)=1),\"OOC\",IF(AND(SIGN(#REF!-#REF!)=-1,SIGN(#REF!-#REF!)=1,SIGN(#REF!-#REF!)=-1,SIGN(#REF!-#REF!)=1,SIGN(L1-#REF!)=-1,SIGN(L2-L1)=1,SIGN(L3-L2)=-1,SIGN(L4-L3)=1,SIGN(L5-L4)=-1,SIGN(L6-L5)=1,SIGN(L7-L6)=-1,SIGN(L8-L7)=1,SIGN(L9-L8)=-1),\"OOC\",\"\")),\"\")","v":""},{"$f":"IF(LEN(ChartData[[#This Row],[check 3 sigma]]),ChartData[[#This Row],[Y]],NA())","v":{"$error":"#N/A"}}]
[null,null,null,null,9,{"$f":"IFERROR(VLOOKUP(SortData[[#This Row],[Unsorted Index]],PasteData[#All],'Intermediate Calcs'!$C$3,0),\"\")","v":""},{"$f":"IFERROR(VLOOKUP(SortData[[#This Row],[Unsorted Index]],PasteData[#All],'Intermediate Calcs'!$C$2,0),\"\")","v":""},{"$f":"IFERROR(RANK(SortData[[#This Row],[Unsorted Dates]],SortData[Unsorted Dates],1)+COUNTIF($F$2:F10,SortData[[#This Row],[Unsorted Dates]])-1,\"\")","v":""},null,9,{"$f":"IFERROR(INDEX(SortData[Unsorted Dates],MATCH(ChartData[[#This Row],[Sorted Index]],SortData[Ranked Dates],0)),\"\")","v":""},{"$f":"IFERROR(INDEX(SortData[Unsorted Data],MATCH(ChartData[[#This Row],[Sorted Index]],SortData[Ranked Dates],0)),\"\")","v":""},"",{"$f":"IF(ISNUMBER(ChartData[[#This Row],[Sorted Dates]]),ChartData[[#This Row],[Sorted Dates]],NA())","v":{"$error":"#N/A"}},{"$f":"IF(ISNUMBER(ChartData[[#This Row],[Sorted Data]]),ChartData[[#This Row],[Sorted Data]],NA())","v":{"$error":"#N/A"}},{"$f":"IF(LEN(ChartData[[#This Row],[Sorted Data]]),$Y$2+$Y$4,NA())","v":{"$error":"#N/A"}},{"$f":"IF(LEN(ChartData[[#This Row],[Sorted Data]]),$Y$2,NA())","v":{"$error":"#N/A"}},{"$f":"IF(LEN(ChartData[[#This Row],[Sorted Data]]),$Y$2-$Y$4,NA())","v":{"$error":"#N/A"}},{"$f":"IF(OR(ChartData[[#This Row],[Y]]>ChartData[[#This Row],[UCL]],ChartData[[#This Row],[Y]]<ChartData[[#This Row],[LCL]]),\"OOC\",\"\")","v":{"$error":"#N/A"}},{"$f":"IFERROR(IF(OR(COUNTIF(L2:L10,\">\"&ChartData[[#This Row],[X-bar]])=9,COUNTIF(L2:L10,\"<\"&ChartData[[#This Row],[X-bar]])=9),\"OOC\",\"\"),\"\")","v":""},{"$f":"IFERROR(IF(AND(SIGN(#REF!-#REF!)=1,SIGN(#REF!-#REF!)=-1,SIGN(#REF!-#REF!)=1,SIGN(L1-#REF!)=-1,SIGN(L2-L1)=1,SIGN(L3-L2)=-1,SIGN(L4-L3)=1,SIGN(L5-L4)=-1,SIGN(L6-L5)=1,SIGN(L7-L6)=-1,SIGN(L8-L7)=1,SIGN(L9-L8)=-1,SIGN(L10-L9)=1),\"OOC\",IF(AND(SIGN(#REF!-#REF!)=-1,SIGN(#REF!-#REF!)=1,SIGN(#REF!-#REF!)=-1,SIGN(L1-#REF!)=1,SIGN(L2-L1)=-1,SIGN(L3-L2)=1,SIGN(L4-L3)=-1,SIGN(L5-L4)=1,SIGN(L6-L5)=-1,SIGN(L7-L6)=1,SIGN(L8-L7)=-1,SIGN(L9-L8)=1,SIGN(L10-L9)=-1),\"OOC\",\"\")),\"\")","v":""},{"$f":"IF(LEN(ChartData[[#This Row],[check 3 sigma]]),ChartData[[#This Row],[Y]],NA())","v":{"$error":"#N/A"}}]
{"$rows_left_out":92}
{"sheet":"validation tables","index":3,"n_rows":9,"n_cols":7,"rows_kept":9,"cut":false,"hidden":false,"merged":[]}
["WHO","WHAT","WHERE1","WHERE2","WHERE3","Condition","Y-axis"]
[{"$f":"\"\"","v":""},{"$f":"\"\"","v":""},{"$f":"\"\"","v":""},{"$f":"\"\"","v":""},null,{"$f":"\"\"","v":""},{"$f":"\"\"","v":""}]
["Operator1",4,"Probe1","MeterA","MeterA","Good",{"$f":"PasteData[[#Headers],[pH 7 drift]]","v":"pH 7 drift"}]
["Operator2",10,"Probe2","MeterB","MeterB","Fair",{"$f":"PasteData[[#Headers],[2nd pH drift]]","v":"2nd pH drift"}]
["Operator3",null,"Probe3",null,"Probe1","Poor",{"$f":"PasteData[[#Headers],[100*pH 7 drift/hr]]","v":"100*pH 7 drift/hr"}]
["Operator4",null,null,null,"Probe2",null,{"$f":"PasteData[[#Headers],[2nd pH drift/hr]]","v":"2nd pH drift/hr"}]
["Operator5",null,null,null,"Probe3",null,{"$f":"PasteData[[#Headers],[slope (%)]]","v":"slope (%)"}]
["Operator6",null,null,null,null,null,{"$f":"PasteData[[#Headers],[offset (mV)]]","v":"offset (mV)"}]
["Operator7"]

{"sheet":"version history","index":4,"n_rows":3,"n_cols":4,"rows_kept":3,"cut":false,"hidden":false,"merged":[]}
[]
[null,"Author","Date","Notable"]
[null,"Tom Treynor","2018-09-30","First released version. Note that whenever this macro-enabled workbook is opened on your computer it will \"enable iterative calculation\" and whenever it is closed it will disable iterative calculation. While iterative calculations are enabled Excel will not warn you of any circular references introduced to any open workbooks."]